Reference ID,First Name,Last Name,Email Address,Phone Number,Nickname,Company Name,Street Address 1,Street Address 2,City,State,Postal Code,Birthday,Memo,Square Customer ID,Creation Source,First Visit,Last Visit,Transaction Count,Total Spend,Email Unsubscribed,Instant Profile
,Aadam,Musawwir,,,,,,,,,,,,WV266RR6XD60CYWVE9YJDGSE18,Instant Profile (via Payment),2019-05-11,2019-05-11,1,$44.31,No,Yes
,Accomplished,Llc,jmiscio@outlook.com,,,,,,,,,,,GSNSSXS53N23EK8DQHT32K770M,Instant Profile (via Payment),2019-07-26,2019-07-26,1,$57.24,No,Yes
,Accomplished,Llc,,,,,,,,,,,,HVVS2A61W53QMQ1S9MCK43CNHR,Instant Profile (via Payment),2019-05-29,2019-05-29,1,$63.60,No,Yes
,Adam,Atkinson,,,,,,,,,,,,91ND0RFT0H012QJA0NEV2D31BR,Instant Profile (via Payment),2019-05-09,2019-05-09,1,$66.78,No,Yes
,Adam,Atkinson,,,,,,,,,,,,ST7S0YS7ZH7D8XRJW0TXZWQ9AC,Instant Profile (via Payment),2019-03-26,2019-07-01,2,$138.65,No,Yes
,Adam,Brutting,,,,,,,,,,,,V6HBV7DFD11ZRV7S741SAF9FJ4,Instant Profile (via Payment),2019-04-15,2019-04-15,1,$54.06,No,Yes
,Adam,Fried,,,,,,,,,,,,7G6YAMFEDN40MVT2QN3ZH4YWER,Instant Profile (via Payment),2019-03-23,2019-03-23,1,$27.56,No,Yes
,Adele,Berger,,,,,,,,,,,,FEWSVE664S1CPWG154NVNESWGC,Instant Profile (via Payment),2019-07-30,2019-07-30,1,$66.78,No,Yes
,Aimee,Greene,aimeepgreene@gmail.com,,,,,,,,,,,GG48N4VEXH0B8TYJD2GQMB8SX4,Instant Profile (via Payment),2019-06-17,2019-06-17,1,$124.87,No,Yes
,Alan,Jackson,,,,,,,,,,,,KW18NXQWAX7JRN1F6F5GBQAT58,Instant Profile (via Payment),2019-07-01,2019-07-01,1,$28.83,No,Yes
,Alan,Sparks,,,,,,,,,,,,JGW68MVGJN3FPHG4YPM15APT58,Instant Profile (via Payment),2019-06-13,2019-07-31,2,$82.20,No,Yes
,,,alanblevine@yahoo.com,,,,,,,,,,,V01XYCQA7N7CAHDSWNF22W86EC,Instant Profile (via Payment),2019-07-03,2019-07-03,1,$55.33,No,Yes
,Alexander,Blossom,,,,,,,,,,,,68CEP9NMDN59PYS28HEGM1HAHG,Instant Profile (via Payment),2019-04-03,2019-04-03,1,$57.24,No,Yes
,Alexander,Dickson,,,,,,,,,,,,4ZHRFMJ5JH1KGN5JH7APTMRRW0,Instant Profile (via Payment),2019-06-15,2019-06-15,1,$82.68,No,Yes
,Alexander,Paumgarten,,,,,,,,,,,,1T19RFTZED7RRZW058RNZ8BW0R,Instant Profile (via Payment),2019-06-05,2019-07-17,2,$314.19,No,Yes
,Alexandra,Cavalli,,,,,,,,,,,,A8YPGPFPJD3GGG38EHNAWCG5FC,Instant Profile (via Payment),2019-04-02,2019-07-02,3,$54.38,No,Yes
,Alexandra,Herman,,,,,,,,,,,,51T9QW9VE9698HY7ZN81PPAEDM,Instant Profile (via Payment),2019-03-30,2019-03-30,1,$34.24,No,Yes
,Alexandra,Noyes,,,,,,,,,,,,Y9MMN1Q27X384QEDSFG50ZRRR4,Instant Profile (via Payment),2019-07-01,2019-07-01,1,$27.67,No,Yes
,Alexandra,Pacor,,,,,,,,,,,,7NN909VEK11VET55PT3DJ716B8,Instant Profile (via Payment),2019-05-26,2019-05-26,1,$63.60,No,Yes
,Alexandra,Runciman,,,,,,,,,,,,J5FDP1CQ7N5FPS5AR1SQC7END4,Instant Profile (via Payment),2019-07-10,2019-07-10,1,$104.94,No,Yes
,Alison,Littke,,,,,,,,,,,,SKT7G6C5W14YATWD9CN4RKKFDR,Instant Profile (via Payment),2019-06-03,2019-06-03,1,$13.36,No,Yes
,Alison,Poole,,,,,,,,,,,,TXRG6HGAQH4D6YQJ4MQ6B1EZF8,Instant Profile (via Payment),2019-07-17,2019-07-17,1,$41.98,No,Yes
,Allison,Hammond,,,,,,,,,,,,SGNNXJ3E3S1CJW9ZRFQM9V87DG,Instant Profile (via Payment),2019-07-28,2019-07-28,1,$70.28,No,Yes
,Allison,Kozar,allisonbkozar@gmail.com,,,,,,,,,,,SZQ4PZCCHX3DCM5HPH524E0MH4,Instant Profile (via Payment),2019-05-10,2019-07-18,4,$312.44,No,Yes
,Allyssa,Messier,,,,,,,,,,,,9CSTT6YEFS21EW0KTKAT8NDB60,Instant Profile (via Payment),2019-04-28,2019-04-28,1,$63.60,No,Yes
,Alyssa,August,,,,,,,,,,,,SWZ6CNC4H57H6TSWAMB8RNK5YR,Instant Profile (via Payment),2019-07-06,2019-07-06,1,$13.99,No,Yes
,Alyssa,Pannizzo,,,,,,,,,,,,BKVQ5NDK691NCGEAZ26M3GSS6R,Instant Profile (via Payment),2019-05-25,2019-05-25,1,$28.62,No,Yes
,Amanda,Ledin,,,,,,,,,,,,XJTV09HCM50AYH1Y3T7KR603N4,Instant Profile (via Payment),2019-04-06,2019-04-06,1,$57.24,No,Yes
,Amanda,Thomas,,,,,,,,,,,,Z995685ZAS6AYKBWWJ2YPCA744,Instant Profile (via Payment),2019-03-23,2019-03-23,1,$40.28,No,Yes
,Amelia,Hiles,,,,,,,,,,,,PYX72TVYGD2JYVWPX88018YNSW,Instant Profile (via Payment),2019-07-30,2019-07-30,1,$11.45,No,Yes
,,,ameyerhong@me.com,,,,,,,,,,,JC1MV6FJS56X0RHWJWWRXD7MAC,Instant Profile (via Payment),2019-03-31,2019-03-31,1,$112.57,No,Yes
,Amity,Arscott,,,,,,,,,,,,R5QKQT27M10S2SKHBFFG96R3AG,Instant Profile (via Payment),2019-04-20,2019-04-20,1,$63.60,No,Yes
,Amy,Farley,,,,,,,,,,,,H32VTD60S97G4ZQMS6RE4MNDHG,Instant Profile (via Payment),2019-05-19,2019-05-19,1,$74.20,No,Yes
,Amy,Harris,amyaharris@gmail.com,,,,,,,,,,,1BGS444DP15ZPP7WSFZWS4S23C,Instant Profile (via Payment),2019-07-19,2019-07-19,1,$89.68,No,Yes
,Amy,Otoole,,,,,,,,,,,,AKJS6NZYY578YKYRQNZ217C774,Instant Profile (via Payment),2019-03-24,2019-03-24,1,$19.72,No,Yes
,Amy,Thompson,,,,,,,,,,,,QVK6YHW5E92HAQ83YGRTYK3WT0,Instant Profile (via Payment),2019-06-01,2019-06-05,2,$57.66,No,Yes
,Anahid,Vann,,,,,,,,,,,,3PM5MMJ30N41EYK8MG0JJFF9G0,Instant Profile (via Payment),2019-04-13,2019-04-13,1,$50.88,No,Yes
,Andrea,Brown,,,,,,,,,,,,PF97FJ5Z9S0X0ZPE1HF7MGFAX0,Instant Profile (via Payment),2019-04-18,2019-04-18,1,$31.48,No,Yes
,Andrea,Brown,,,,,,,,,,,,Z5CQZY8JCS344HP1DS63PHFRA0,Instant Profile (via Payment),2019-05-31,2019-05-31,2,$95.82,No,Yes
,Andrea,Hamor,,,,,,,,,,,,M9J61W7N352RGH2ZAV3H49DZD8,Instant Profile (via Payment),2019-04-10,2019-06-06,2,$107.33,No,Yes
,Andrea,Klein,,,,,,,,,,,,0MS517HMQS0K8MXVSTKKFK47E8,Instant Profile (via Payment),2019-05-25,2019-05-25,1,$12.72,No,Yes
,Andrea,Otto,,,,,,,,,,,,7F7RXVK7195RES2MSX3EBJH1NR,Instant Profile (via Payment),2015-07-04,2015-07-04,1,$16.96,No,Yes
,Andrea,Thompson,,,,,,,,,,,,3SJC3WR0VH4P4YV751RJG4XQBR,Instant Profile (via Payment),2019-05-26,2019-05-26,1,$106.00,No,Yes
,Andrea,Toulouse,andreamyoung@gmail.com,,,,,,,,,,,1YFVB6Q5K91XYP7DDHJ68182D4,Instant Profile (via Payment),2019-07-17,2019-07-17,1,$162.18,No,Yes
,Andrea,Vinard,,,,,,,,,,,,D6KQ1X70J14SWYN0KWZHCF38VC,Instant Profile (via Payment),2019-07-26,2019-07-26,1,$23.32,No,Yes
,Andres,Michelena,,,,,,,,,,,,QZJHB8H1FN3D2Y5M1J0R4ZCAVM,Instant Profile (via Payment),2019-05-24,2019-05-24,1,$42.40,No,Yes
,Andrew,Arsenault,,,,,,,,,,,,HD4R0PJRXH40PPGWZJ2T8QNEY0,Instant Profile (via Payment),2019-04-23,2019-04-23,1,$27.03,No,Yes
,Andrew,Chmura,andrew@grandslamtennistours.com,,,,,,,,,,,EET901NZ655VYN85GKG6EQ06BR,Instant Profile (via Payment),2019-07-29,2019-07-29,1,$96.04,No,Yes
,Andrew,Hogan,,,,,,,,,,,,4W8H1REJEN4KEPY2KM9JN3JDD8,Instant Profile (via Payment),2019-05-11,2019-05-11,1,$42.93,No,Yes
,Andrew,Johannesen,,,,,,,,,,,,PBMFZ4AXGN6FWP5N7VXKK9TQ8G,Instant Profile (via Payment),2019-06-15,2019-06-15,1,$53.00,No,Yes
,Andrew,Kliger,,,,,,,,,,,,EVG11ZKQRH3V6HX9WQVP71PC30,Instant Profile (via Payment),2019-04-06,2019-04-06,1,$82.04,No,Yes
,Andrew,Willis,,,,,,,,,,,,50RZH6D42N5M2Q0NFK8DXBKY9C,Instant Profile (via Payment),2019-05-11,2019-05-11,1,$86.04,No,Yes
,Andrew,Zovistoski,,,,,,,,,,,,336ZFA359H714MZJFB18KTZHPR,Instant Profile (via Payment),2019-06-22,2019-06-22,1,$19.08,No,Yes
,Angel,Santiago,,,,,,,,,,,,9CAE068DKX1R2H6G94ZXG58NZG,Instant Profile (via Payment),2019-07-10,2019-07-10,1,$36.04,No,Yes
,Angela,Daniels,,,,,,,,,,,,JXGTVJZF5X17TK0J28127BA1KG,Instant Profile (via Payment),2019-03-26,2019-04-19,2,$61.21,No,Yes
,Angela,Hurlbert,,,,,,,,,,,,4N80BB1Z4D46PJV84632685KXR,Instant Profile (via Payment),2015-07-04,2015-07-04,1,$61.48,No,Yes
,Angela,Therrien,,,,,,,,,,,,5RVV5FF2ND3CWMDA5ZDRR2F9FG,Instant Profile (via Payment),2019-05-02,2019-05-18,2,$55.97,No,Yes
,Angela,Therrien,,,,,,,,,,,,VEGH8CGQMX2YEHTQ3QV5ZV05TC,Instant Profile (via Payment),2019-03-30,2019-03-30,1,$49.61,No,Yes
,Ann,Fetsch,,,,,,,,,,,,FPVFQWQXDX4V2Y68GBS4R98YT0,Instant Profile (via Payment),2019-07-29,2019-07-29,2,$59.15,No,Yes
,Ann,Messier,amessier@smuggs.com,,,,,,,,,,,PRK9T7B8XS2V6YDBP7J7CPEWK0,Instant Profile (via Payment),2019-05-24,2019-05-24,1,$145.01,No,Yes
,Ann,Patnoe,,,,,,,,,,,,HTZ70YXZ3915GGVZNCBPSFX9ZG,Instant Profile (via Payment),2019-03-30,2019-03-30,1,$44.31,No,Yes
,Ann,Ritchie,,,,,,,,,,,,ZPD8WJVZRS50MQ6509TXHR6BFC,Instant Profile (via Payment),2019-06-22,2019-06-22,1,$185.50,No,Yes
,Ann,Spearing,annspearing@gmail.com,,,,,,,,,,,R29ND6CSAH4NWMJDB4YTY99ZTW,Instant Profile (via Payment),2019-05-31,2019-06-10,2,$36.04,No,Yes
,Anna,Szatela,,,,,,,,,,,,90J9D32ZGX2Q4GXA6NX5V9MT9C,Instant Profile (via Payment),2019-07-20,2019-07-20,1,$59.15,No,Yes
,Anne,Grantham,,,,,,,,,,,,GE9RXYXC4531AJ5Z0DCFCDS890,Instant Profile (via Payment),2019-03-24,2019-05-31,3,$136.27,No,Yes
,Anne,Meixner,,,,,,,,,,,,FCFD0DA5912S4Y74RW74NVPH4G,Instant Profile (via Payment),2019-04-13,2019-04-13,1,$63.60,No,Yes
,Anne,Panero,,,,,,,,,,,,1QAV4EBYK5372YFNHSHCN64RN4,Instant Profile (via Payment),2019-07-20,2019-07-20,1,$154.76,No,Yes
,Anne,Steel,,,,,,,,,,,,DWCW2N3F510K4P2Y5JMSCM3K68,Instant Profile (via Payment),2019-06-25,2019-07-17,2,$104.94,No,Yes
,Anthony,Bambara,,,,,,,,,,,,5JXYC5C3M94YETYM8WJ9AMK3NW,Instant Profile (via Payment),2019-07-01,2019-07-01,1,$10.00,No,Yes
,Anton,Chuidian,,,,,,,,,,,,G3TWAY9E1971AZ5KY0TZ72W6J8,Instant Profile (via Payment),2019-06-29,2019-06-29,1,$93.28,No,Yes
,,,aolsson@umass.edu,,,,,,,,,,,EH2ZMW6RBN2D2TNSBC7RQ6YCK0,Instant Profile (via Payment),2019-05-31,2019-06-28,2,$34.34,No,Yes
,Apprentice,Athletics,,,,,,,,,,,,JK52ZQC9X93RAST7AJMXDKM9TG,Instant Profile (via Payment),2019-07-20,2019-07-20,1,$25.44,No,Yes
,Arlene,Frank,petnannyofqueens@aol.com,,,,,,,,,,,1TYX2G04E110VC1YAXCWWA35EW,Directory,,,0,0,No,No
,Ashley,Ambroz,,,,,,,,,,,,N7PCENMR2H2MEGNV28XFMKEDN0,Instant Profile (via Payment),2019-05-11,2019-05-11,1,$21.20,No,Yes
,Ashley,Maxfield,,,,,,,,,,,,2JREH95JN134RYBRG0GX4P9S3G,Instant Profile (via Payment),2019-04-20,2019-04-20,1,$20.14,No,Yes
,Ashley,Vicich,,,,,,,,,,,,84EAYBMAZX3KJSNBA4Z5WDQ0RC,Instant Profile (via Payment),2019-07-19,2019-07-19,1,$19.08,No,Yes
,Audra,Bickings,abickings@sitesul.com,,,,,,,,,,,9YW1WGD2Z959JKXK2NHG9C00KR,Instant Profile (via Payment),2019-04-05,2019-04-26,2,$101.36,No,Yes
,Autumn,Puddicombe,a.l.puddicombe@gmail.com,,,,,,,,,,,BVM2AZ32X95PYKMJFNK593H6ZC,Instant Profile (via Payment),2019-04-19,2019-04-19,1,$25.44,No,Yes
,Ayesha,Siddika,,,,,,,,,,,,W8PAAYM5J56ARHS6WR2X2SC6TG,Instant Profile (via Payment),2019-04-28,2019-04-28,1,$7.95,No,Yes
,Barbara,Baker,,,,,,,,,,,,Z2C4EPGJQ57BYH2NG7MQ3H8XW0,Instant Profile (via Payment),2019-07-07,2019-07-07,1,$57.24,No,Yes
,Barbara,Dreska,,,,,,,,,,,,KCWSP0ENFH5NYRWSN9BGF22GPM,Instant Profile (via Payment),2019-05-11,2019-07-20,2,$272.69,No,Yes
,Barbara,Malczyk,,,,,,,,,,,,82MCPP1RC111CSJ1EQFCP4GPFR,Instant Profile (via Payment),2019-07-20,2019-07-20,1,$61.48,No,Yes
,Barbara,Waugh,,,,,,,,,,,,RJ7JE3YA0X0T8MC3MDVW4PW1WW,Instant Profile (via Payment),2019-05-02,2019-05-02,1,$91.58,No,Yes
,Benjamin,Clarkin,,,,,,,,,,,,2SWQCTGXKX5CJG1Q349NMD2DH4,Instant Profile (via Payment),2019-06-01,2019-06-01,1,$38.16,No,Yes
,Benjamin,Mcshane,,,,,,,,,,,,TB4Y4HEAXN16AHNKF6JVXJJQE8,Instant Profile (via Payment),2019-06-15,2019-06-15,1,$53.00,No,Yes
,Benjamin,Oliveri,,,,,,,,,,,,YHAS7JAQY504AMX45HND08SXFC,Instant Profile (via Payment),2019-05-29,2019-05-29,1,$42.93,No,Yes
,Benton,Boothby,,,,,,,,,,,,8DZ7V8798H1SJKVBCGB1S25864,Instant Profile (via Payment),2019-04-14,2019-04-14,1,$25.44,No,Yes
,Betsy,Borup,,,,,,,,,,,,HH9YNG83312DCMHPYBYEKGKJSM,Instant Profile (via Payment),2019-03-28,2019-03-28,1,$78.23,No,Yes
,Beverly,Beach,,,,,,,,,,,,C0759XQ68523MP51766RBGHFWC,Instant Profile (via Payment),2019-03-29,2019-03-29,1,$86.97,No,Yes
,Bill,Lockwood,,,,,,,,,,,,2W6TRGWQ8N424SWGQRFKE2DXQG,Instant Profile (via Payment),2019-05-18,2019-05-18,1,$44.52,No,Yes
,Billings,Cooke,,,,,,,,,,,,98JC5J64ZN0NTMBH2D6X7JNPWG,Instant Profile (via Payment),2019-04-12,2019-06-12,2,$44.31,No,Yes
,Bogdan,Genchev,,,,,,,,,,,,Z86SVFSZRD45WR7C7Y2V669W14,Instant Profile (via Payment),2019-07-02,2019-07-02,1,$15.26,No,Yes
,Bonnie,Crelling,,,,,,,,,,,,9Y4A6Z89HH5XCXKHC2YSSNTAB0,Instant Profile (via Payment),2019-07-06,2019-07-06,1,$33.92,No,Yes
,Booska,Movers,,,,,,,,,,,,GA3Z6Q9K2S0VYT6RCW7ZDMRA4M,Instant Profile (via Payment),2019-05-08,2019-05-08,1,$179.35,No,Yes
,Bradley,Albers,,,,,,,,,,,,NF3G82SS4H6K8QZAQ2PDDCJHJM,Instant Profile (via Payment),2019-07-26,2019-07-26,1,$10.49,No,Yes
,Brenda,Staples,,,,,,,,,,,,8NBKWS2Q7S5M8XNXM13DNEX9G8,Instant Profile (via Payment),2019-06-30,2019-06-30,1,$51.52,No,Yes
,Brendan,Beninghof,,,,,,,,,,,,123394GVFX72GWSC5Q1T0PSTTG,Instant Profile (via Payment),2019-06-26,2019-06-26,1,$57.24,No,Yes
,Brendan,Martin,chefbrendan@yahoo.com,,,,,,,,,,,GM25REKJ492HHAGV6WHERANHD0,Directory,,,0,0,No,No
,Brenna,Angelillo,,,,,,,,,,,,VC0AK2RQ41472GRQ57SNGERM34,Instant Profile (via Payment),2019-04-16,2019-04-16,1,$63.60,No,Yes
,Brent,Orlowski,borlowski7@gmail.com,,,,,,,,,,,90VQA1C35N4XEY3ARJ1E8JPZBW,Instant Profile (via Payment),2019-04-12,2019-04-12,1,$134.13,No,Yes
,Brent,Zalezniak,,,,,,,,,,,,4Q3YBPQV0919PNMKQAJXQ2J9QM,Instant Profile (via Payment),2019-03-23,2019-03-23,1,$38.16,No,Yes
,Brian,Armstrong,,,,,,,,,,,,8F19X5EQWX02YGQX93SR79CNZR,Instant Profile (via Payment),2019-05-31,2019-05-31,1,$40.28,No,Yes
,Brian,Buczek,,,,,,,,,,,,1VTPA1FRVS066XCGTJ2CRY6TP4,Instant Profile (via Payment),2019-07-27,2019-07-27,1,$63.07,No,Yes
,Brian,Canzanella,,,,,,,,,,,,WAS4XBBF6S2GCNETZERE4T01SM,Instant Profile (via Payment),2019-06-05,2019-06-05,1,$27.56,No,Yes
,Brian,Farrelly,brian.farrelly23@gmail.com,,,,,,,,,,,MP0NT4GC1X1E90K4MED2AXDH40,Directory,,,0,0,No,No
,Brian,Hynes,,,,,,,,,,,,1ESZN4W3TS5MJPVA59WQ7Q90EW,Instant Profile (via Payment),2019-07-25,2019-07-25,1,$36.04,No,Yes
,Brian,O'connor,brioconno@aol.com,,,,,,,,,,,B0205T9PWN228SNK7SG4B62808,Instant Profile (via Payment),2019-04-15,2019-04-15,1,$30.53,No,Yes
,Brittany,Bird,,,,,,,,,,,,2X27ZNAZ354P6KTES6ME3FPC9W,Instant Profile (via Payment),2019-06-21,2019-06-21,1,$30.21,No,Yes
,Brittany,Hay,,,,,,,,,,,,HRQ65YKEMS1J2ZQ9F2KZ0MRGN0,Instant Profile (via Payment),2019-07-21,2019-07-21,1,$55.33,No,Yes
,Brittney,Fricke,,,,,,,,,,,,MX3HGH3QH90XAQXWJKKZ3MJC1R,Instant Profile (via Payment),2019-07-25,2019-07-25,1,$38.16,No,Yes
,Bruce,Loren,,,,,,,,,,,,QVH65WFA5D7QYWE26T541R8GXG,Instant Profile (via Payment),2019-06-16,2019-06-16,1,$14.84,No,Yes
,Bruce,Olsson,,,,,,,,,,,,CXY2C88E794XPPR0E9YY11TF3G,Instant Profile (via Payment),2019-03-25,2019-03-25,1,$18.13,No,Yes
,Bryan,Youngs,,,,,,,,,,,,2ETQTH9XP118PMRDPQ1K7BRN2W,Instant Profile (via Payment),2019-06-11,2019-06-11,1,$27.03,No,Yes
,Bryce,Coster,,,,,,,,,,,,E3MK5VCMR904CXBCXXPM4Y0DH4,Instant Profile (via Payment),2019-04-13,2019-04-13,1,$53.00,No,Yes
,Caelyn,Carrier,,,,,,,,,,,,HQVWT6Y9HX3HWYRH6VJK7T4DWR,Instant Profile (via Payment),2019-04-20,2019-04-20,1,$38.16,No,Yes
,Caitlin,Brown,,,,,,,,,,,,ZXXBT32JA129MNK0J9W27DH5R0,Instant Profile (via Payment),2019-07-19,2019-07-19,1,$20.99,No,Yes
,Calvin,Engle,,,,,,,,,,,,5MDNEPJNWH5KWJAY30B0Y4JXQ8,Instant Profile (via Payment),2019-05-25,2019-05-25,1,$51.52,No,Yes
,Cameron,Chapman,,,,,,,,,,,,5412ECN4CD3Q4H1KYGWZ5XAS6R,Instant Profile (via Payment),2019-04-02,2019-04-02,1,$33.92,No,Yes
,Cameron,Chapman,,,,,,,,,,,,68MBXJNVGX7H6NZKNGCCSPPEXM,Instant Profile (via Payment),2019-04-20,2019-05-26,2,$72.08,No,Yes
,Cameron,Milles,cmilles23@gmail.com,1 404-538-5962,,,,,,,,,,VXSYQ1HJ2X62H4YFN9HTYTK79G,Directory,2020-01-17,2020-01-17,1,$93.80,No,No
,Cameron,Warren,,,,,,,,,,,,WXGZT5QS812HTSPHQT8C78E184,Instant Profile (via Payment),2019-05-10,2019-05-10,1,$20.14,No,Yes
,Camilla,Gregory,,,,,,,,,,,,GVQDDCD95516WM3H0GRM1DSM0M,Instant Profile (via Payment),2019-03-25,2019-03-25,1,$101.55,No,Yes
,Camille,Granitz,,,,,,,,,,,,QXEXQC0J4H01B3XC592SSK90A8,Instant Profile (via Payment),2019-11-21,2019-11-21,1,$42.40,No,Yes
,Camille,Phillips,,,,,,,,,,,,KNFKMHW7W531EYQZQDZG3B4R5R,Instant Profile (via Payment),2019-04-13,2019-04-13,1,$61.48,No,Yes
,Candace,Ingersoll,,,,,,,,,,,,HHM1MW8JZN0RPWK7NYTVJTY9NW,Instant Profile (via Payment),2019-07-11,2019-07-11,1,$62.96,No,Yes
,Cara,A,madadashcar@gmail.com,'+18027607691,,,,,,,,,,MZNGD9GDT95ZS21Y63MGD02DZG,Directory,2019-03-28,2019-06-07,2,$233.20,No,No
,Cara,Richards,Caram3a@gmail.com,'+18025056777,,,,,,,,,,920KRBEVT56YXF73QT5ARPZV70,Directory,2019-08-09,2019-11-22,3,$288.00,No,No
,Carine,Stern,,,,,,,,,,,,8TVMZR73A15B6NGZ3HQF83XEFR,Instant Profile (via Payment),2019-06-15,2019-06-15,1,$25.44,No,Yes
,Carla,Patti-Wise,cpwise@comcast.net,,,,19722 Bellewood Dr,,Centennial,Colorado,80015,,,MFNGXCYE8H6MZ6ZM09WJ517TB8,Directory,2019-09-08,2019-10-31,2,$122.40,No,No
,Carol,Spicer,,,,,,,,,,,,JGXH8Q15Z968MYX1K3433PMRWC,Instant Profile (via Payment),2019-07-08,2019-07-08,1,$95.67,No,Yes
,Carol,Teplick,,,,,,,,,,,,QZ35FD47Z54WAVSB78QVXBJH58,Instant Profile (via Payment),2019-07-31,2019-07-31,1,$28.83,No,Yes
,Carole,Emond,,,,,,,,,,,,CEG1Q66FVH3QYZ29ETD8B2P5X4,Instant Profile (via Payment),2019-05-22,2019-05-22,1,$86.60,No,Yes
,Carole,Emond,,,,,,,,,,,,VX9TSMTX0D5PPVAX54C2M3CY8G,Instant Profile (via Payment),2019-06-22,2019-06-22,1,$100.70,No,Yes
,Caroline,Mudge,,,,,,,,,,,,HY5ENFXZF14MANSPGBC1S0GEDR,Instant Profile (via Payment),2019-05-04,2019-05-04,1,$26.23,No,Yes
,Caroline,Wiegand,,,,,,,,,,,,8XG6M2NHV16TRZ07H58XY1KVA8,Instant Profile (via Payment),2019-06-29,2019-06-29,1,$42.40,No,Yes
,Carrie,Smith,,,,,,,,,,,,98GC2KS9JD4AGK2EGG17W91TNC,Instant Profile (via Payment),2019-05-02,2019-05-02,1,$27.56,No,Yes
,Cassandra,Perrone,runcassrun@gmail.com,,,,,,,,,,,M7S5R9G8CH1JGN1GN7RAJ6677W,Instant Profile (via Payment),2019-07-02,2019-07-02,1,$60.42,No,Yes
,Cassy,Carrera,,,,,,,,,,,,30J7640S6H35AWHZD8J4S7ZWQC,Instant Profile (via Payment),2019-05-19,2019-05-19,1,$11.66,No,Yes
,Catherine,Ehrlich,,,,,,,,,,,,PENXDHW0A14J6TYFD9AKA6HMSM,Instant Profile (via Payment),2019-06-01,2019-06-01,1,$16.96,No,Yes
,Catherine,Rehm,,,,,,,,,,,,FPS5JB78NH60PTM1Q4EAQFTA7R,Instant Profile (via Payment),2019-07-17,2019-07-17,1,$18.02,No,Yes
,Cathy,Foster,,,,,,,,,,,,F01GGHNRZX116YD14N501H94A0,Instant Profile (via Payment),2019-07-08,2019-07-08,1,$105.73,No,Yes
,Cathy,Lawrence,,,,,,,,,,,,CT3M0ZZ3J12J4MJFQS7MH28R4R,Instant Profile (via Payment),2019-05-03,2019-05-03,1,$51.52,No,Yes
,Cathy,Potenziani,catherine.potenziani@yahoo.com,'+15617671421,,,,,,,,,,VVSAB9ZY0H49X2PRBAS6R7NC80,Directory,2019-04-25,2020-01-12,7,$759.20,No,No
,Chad,Donna,chaddonna1@gmail.com,,,,,,,,,,,RH9N6N151D7P2P6WQ2M4ZJKK0W,Instant Profile (via Payment),2019-05-20,2019-05-20,1,$28.62,No,Yes
,Chad,Sher,,,,,,,,,,,,GGNC1N5S4X1SWY5EXVN5YD1NYW,Instant Profile (via Payment),2019-07-15,2019-07-15,1,$33.92,No,Yes
,Chairity,Derose,,,,,,,,,,,,TQR8AZQ1PN2KPMW05SPWR8DN4C,Instant Profile (via Payment),2019-05-30,2019-05-30,1,$21.20,No,Yes
,Champ,Humphreys,,,,,,,,,,,,TV25QHZB5521PTW25DKQYXM3M4,Instant Profile (via Payment),2019-07-19,2019-07-19,1,$36.25,No,Yes
,Chantal,Mehanna,chantalmehanna@gmail.com,,,,,,,,,,,GG5XJ33W715R8PDH35GAGJ1YW0,Instant Profile (via Payment),2019-04-26,2019-04-26,1,$57.24,No,Yes
,Charlene,Walker,,,,,,,,,,,,1ECK9VHCWS4J8XXSBZ3M3T5H3M,Instant Profile (via Payment),2019-03-23,2019-04-07,2,$66.46,No,Yes
,Charles,Baxter,,,,,,,,,,,,MJFJHH7R9N4QJSY0SGXCE87FMW,Instant Profile (via Payment),2019-06-28,2019-06-28,1,$98.26,No,Yes
,Charles,Gangas,,,,,,,,,,,,7V2WD7YJ3560TJ8QG5Q9K1XECR,Instant Profile (via Payment),2019-06-30,2019-06-30,1,$120.84,No,Yes
,Charles,Humphreys,,,,,,,,,,,,9T8PEZCEXX5G2HJ4W2VGRSFM80,Instant Profile (via Payment),2019-07-19,2019-07-19,1,$15.26,No,Yes
,Charles,Lindig,,,,,,,,,,,,NJ8TGWKGM16FJTNVZCGRE2P46R,Instant Profile (via Payment),2019-06-30,2019-06-30,1,$63.60,No,Yes
,Charles,Mehrtens,charlesmehrtens@gmail.com,,,,,,,,,,,989J37865X70TVKBDHEDXPK38M,Instant Profile (via Payment),2019-07-22,2019-07-22,1,$30.53,No,Yes
,Charles,Schwartz,,,,,,,,,,,,7RCX7ESXCD740KE2P3T66YST00,Instant Profile (via Payment),2019-05-22,2019-05-22,1,$120.84,No,Yes
,Chase,Cardholder,dcmhartman@yahoo.com,,,,,,,,,,,AJMGXYE3S14SPSV867CKNNMQ74,Instant Profile (via Payment),2019-07-06,2019-07-06,1,$74.20,No,Yes
,Chase,Cardholder,,,,,,,,,,,,J1B3R7QKYS6W4WRCVJF39W4AFM,Instant Profile (via Payment),2019-05-10,2019-05-10,1,$19.08,No,Yes
,Chase,Cardholder,,,,,,,,,,,,AVHD2VPYBN2TAQ8RW40NEXSYCM,Instant Profile (via Payment),2019-06-23,2019-06-23,1,$83.95,No,Yes
,Chase,Cardholder,hbscadoc@hotmail.com,,,,,,,,,,,T1RJ8D1MHS3A4WZ8VTQPSY6JGG,Instant Profile (via Payment),2019-07-02,2019-07-02,1,$74.20,No,Yes
,Chelsea,Camarata,,,,,,,,,,,,6W0QM7ESVS49TPH8E7S89KR80M,Instant Profile (via Payment),2019-04-21,2019-04-21,1,$31.80,No,Yes
,Chelsea,Russell,92crussell@gmail.com,,,,,,,,,,,T8W6GB8SWS0TPV2T0F9WV392H8,Instant Profile (via Payment),2019-06-27,2019-06-27,1,$62.96,No,Yes
,Chelsea,Smith,chelseaislamee@gmail.com,,,,,,,,,,,G5VVECFARH7XAPDM50J7M2AQK0,Instant Profile (via Payment),2019-04-01,2019-04-01,1,$37.74,No,Yes
,Chelsea,Stetson,,,,,,,,,,,,N6FSX3ZD7S7Z8T1VMGWE65V6P8,Instant Profile (via Payment),2019-04-28,2019-04-28,1,$33.92,No,Yes
,Cheryl,Rice,cheririce@gmail.com,,,,,,,,,,,ZM8Q6TXP612H4NJ94Z1AHGKRPG,Instant Profile (via Payment),2019-03-30,2019-03-30,1,$55.33,No,Yes
,Cheryl,Tardy,,,,,,,,,,,,6XRPR3S8HX65ENRM8DGVNP9410,Instant Profile (via Payment),2019-07-11,2019-07-11,1,$21.20,No,Yes
,Chloe,Cartularo,,,,,,,,,,,,D064KATSJS0JWWWAPWV8ENJ6MW,Instant Profile (via Payment),2019-05-19,2019-05-19,1,$78.44,No,Yes
,Chris,Aldrich,,,,,,,,,,,,53XDKTJTBX0EWPAH7QQND5F9Z0,Instant Profile (via Payment),2019-03-24,2019-03-24,1,$29.73,No,Yes
,Christine,Gordon,hhgcag94@aol.com,,,,,,,,,,,YFHPHKGD5D0SCPQYCJ45T7MY24,Instant Profile (via Payment),2019-07-05,2019-07-05,1,$74.41,No,Yes
,Christine,Larow,,,,,,,,,,,,7CP8VS4TYD38RXZBCC7YQ3JBKC,Instant Profile (via Payment),2019-04-12,2019-06-26,3,$316.09,No,Yes
,Christine,Quine,,,,,,,,,,,,DQ2CVS4395718PSMC586AM38KM,Instant Profile (via Payment),2019-05-11,2019-05-11,1,$62.75,No,Yes
,Christine,Tighe,,,,,,,,,,,,B5NQSADNQ16J2HTEDFHKQKNH9R,Instant Profile (via Payment),2019-07-28,2019-07-28,1,$43.88,No,Yes
,Christop,Colvin,,,,,,,,,,,,KADGYHWCD15MEKWCJNQNHCY99M,Instant Profile (via Payment),2019-05-18,2019-05-18,1,$58.51,No,Yes
,Christophe,Mask,,,,,,,,,,,,00NQRZBWMX0Z0S8KTRSH0EP5QG,Instant Profile (via Payment),2019-03-30,2019-03-30,1,$50.46,No,Yes
,Christopher,Boyea,,,,,,,,,,,,XZJPFY4WS90C2XGDX5SJ8T9DW8,Instant Profile (via Payment),2019-04-05,2019-06-09,4,$449.65,No,Yes
,Christopher,Cosentino,,,,,,,,,,,,Z0Q33QYSGD2SYY5XEXWKK88YJ0,Instant Profile (via Payment),2019-06-20,2019-06-20,1,$187.30,No,Yes
,Christopher,Greeley,,,,,,,,,,,,9A6TC4BTGH2E2N6D4GX15EWEZ8,Instant Profile (via Payment),2019-07-20,2019-07-20,1,$42.40,No,Yes
,Christopher,Grugan,,,,,,,,,,,,G36QAH11NS104QY9Y24PBYCV0R,Instant Profile (via Payment),2019-03-31,2019-03-31,1,$130.38,No,Yes
,Christopher,Hawthorne,,,,,,,,,,,,4ZDV63A0R146RVNGHAP6WQ3B28,Instant Profile (via Payment),2019-04-15,2019-04-15,1,$42.93,No,Yes
,Christopher,Kaczmarek,,,,,,,,,,,,Z1DAYM809N6VTW3GNBM7Y0JD4W,Instant Profile (via Payment),2019-07-20,2019-07-20,1,$15.26,No,Yes
,Christopher,Moroch,,,,,,,,,,,,83JCT83PYN3MCQTPJXH0KX4PH0,Instant Profile (via Payment),2019-07-12,2019-07-12,1,$108.12,No,Yes
,Christopher,Moroch,,,,,,,,,,,,S7DM7FTP2X0DGXMVW4F2KTRD9R,Instant Profile (via Payment),2019-04-23,2019-04-23,1,$184.71,No,Yes
,Christopher,Novak,,,,,,,,,,,,8CH7GD3KV50EGZSR27W1AMR7AC,Instant Profile (via Payment),2019-06-01,2019-06-01,1,$15.90,No,Yes
,Christopher,Novak,,,,,,,,,,,,6JCVGAYATX5W2VDMR3JV50F64C,Instant Profile (via Payment),2019-06-01,2019-06-01,1,$53.00,No,Yes
,Christopher,Ryan,,,,,,,,,,,,B2A9C8YT2138RYWEYMSQ5SVC9R,Instant Profile (via Payment),2019-06-05,2019-06-05,1,$105.73,No,Yes
,Christopher,Willis,,,,,,,,,,,,2R8QNVKHSS0TGJHPP7NFJPRGTR,Instant Profile (via Payment),2019-05-20,2019-05-20,1,$28.20,No,Yes
,Cindy,Vaughan,,,,,,,,,,,,8R4K3CM0TH3YYHBMHSG0A5JYWG,Instant Profile (via Payment),2019-06-22,2019-06-25,2,$95.40,No,Yes
,Claire,Misko,home@miskoinc.com,,,,,,,,,,,ZB05MCNN1944RVWG24BGSDM6CM,Instant Profile (via Payment),2019-07-17,2019-07-17,1,$96.46,No,Yes
,,,claudianeto@icloud.com,,,,,,,,,,,7PFX3DC5WS3AYPR1VDAJ3XYAX4,Instant Profile (via Payment),2019-06-18,2019-06-18,1,$184.39,No,Yes
,Cody,Quattrocci,,,,,,,,,,,,92B0K25EG12NAXVEJ9P4E7SQ40,Instant Profile (via Payment),2019-05-13,2019-05-13,1,$50.35,No,Yes